{"text_format":"1","workbook":"xlsx","n_sheets":6,"sheets":["Instructions","Input Data","Patients","Actions","Antibiotic","Lookups"],"not_rendered":{"charts":18,"images":1,"macros":0,"external_links":0,"defined_names":28,"comments":0,"pivot_tables":0},"unopened":[],"bounds":{"document_bytes":16777216,"sheet_cells":100000,"rows_first":2000,"rows_last":500,"rows_between":2000,"halvings":0,"cell_chars":16384,"cell_head_chars":4096},"cells_cut":0,"cells_raw":0,"read":"whole","date_system":"1900"}

{"sheet":"Instructions","index":0,"n_rows":50,"n_cols":17,"rows_kept":50,"cut":false,"hidden":false,"merged":[[22,1,24,1],[25,1,29,1],[31,1,35,1],[36,1,44,1],[49,1,49,5],[14,1,14,2],[14,3,14,5],[15,1,15,19],[16,1,16,19],[14,7,14,12],[11,1,11,19],[10,1,10,19],[12,1,12,19],[13,1,13,19],[0,1,0,12],[0,16,0,19],[4,1,6,19]]}
[null,null,null,null,null,null,null,null,null,null,null,null,null,null,null,null,"https://www.sapg.scot/"]
[]
[null,"Scottish Reduction in Antimicrobial Prescribing 2 (ScRAP 2) Acute Urinary Tract Infection Audit Tool"]
[]
[null,"Welcome to the national tool developed by the Scottish Antimicrobial Prescribing Group (SAPG) for the audit of primary care management of acute urinary tract infections.  The tool is intended to provide prescribers with qualitative information on their prescribing of antibiotics.  The results will facilitate reflective learning on the processes leading up to the decision to prescribe antibiotics in patients with an acute UTI.  The tool will allow prescribers to compare their prescribing decisions with local guidance and will support identification of areas for quality improvement.  "]
[]
[]
[]
[]
[null,"Guidance"]
[null,"Use a new workbook for each audit period."]
[null,"Identify patients who have been prescribed UTI antibiotics during the audit period (trimethoprim, nitrofurantoin, coamoxiclav, cefalexin, fosfomycin, pivmecillinam, ciprofloxacin, ofloxacin)."]
[null,"Restrospectively audit the management of those who have been treated for acute episodes of UTI."]
[null,"Suggested minimum audit period is 1 month (average practice) or 50 patients (NB the maximum number of patients that can be audited in any period is 1000)."]
[null,"Audit against the",null,"PHE Quick Reference Guide ",null,null,"or the ","SAPG Management of Suspected UTI in People over 65 years",null,null,null,null,null," "]
{"$rows_left_out":36}
{"sheet":"Input Data","index":1,"n_rows":1003,"n_cols":25,"rows_kept":1003,"cut":false,"hidden":false,"merged":[[0,4,0,9],[0,10,0,14],[0,15,0,23],[0,1,0,3]]}
["Topic","Audit details",null,null,"Patient",null,null,null,null,null,"Actions",null,null,null,null,"Antibiotic prescription",null,null,null,null,null,null,null,null,"Comments"]
["Q",1,2,3,4,5,6,7,8,9,10,11,12,13,14,15,16,17,18,19,20,21,22,23,24]
["Case","Practice ID","Auditor ID","Audit date range","Prescriber ID","Patient ID","Age range","Care home resident?","Receiving antibiotic prophylaxis?","UTI type","Consultation type","Dipstick required/done","Reason dipstick not in line with guidance","Culture required/done","Reason culture not in line with guidance","Was an antibiotic required?","Reason why antibiotic not required","Which antibiotic prescribed","Choice of antibiotic appropriate?","Reason choice inappropriate ","Dose appropriate?","Frequency appropriate?","Duration appropriate?","Delayed?","Additional comments "]
[1]
[2]
[3]
[4]
[5]
[6]
[7]
[8]
[9]
[10]
[11]
[12]
{"$rows_left_out":989}
{"sheet":"Patients","index":2,"n_rows":14,"n_cols":40,"rows_kept":14,"cut":false,"hidden":false,"merged":[[0,0,0,1]]}
["Patient details"]
[]
[]
["Q6","Age range","Count","% of cases",null,null,null,null,null,null,null,null,null,null,"Q7","Care home resident?","Count","% of cases",null,null,null,null,null,null,null,"Q8","Receiving antibiotic prophylaxis?","Count","% of cases",null,null,null,null,null,null,null,"Q9","UTI type","Count","% of cases"]
[null,"0 to 4 years",{"$f":"COUNTIF('Input Data'!$G$4:$G$1003,Patients!B5)","v":0},{"$f":"(C5/$C$12)*100","v":{"$error":"#DIV/0!"}},null,null,null,null,null,null,null,null,null,null,null,"Yes",{"$f":"COUNTIF('Input Data'!$H$4:$H$1003,Patients!P5)","v":0},{"$f":"(Q5/$Q$7)*100","v":{"$error":"#DIV/0!"}},null,null,null,null,null,null,null,null,"Yes",{"$f":"COUNTIF('Input Data'!$I$4:$I$1003,Patients!AA5)","v":0},{"$f":"(AB5/$AB$7)*100","v":{"$error":"#DIV/0!"}},null,null,null,null,null,null,null,null,"Female uncomplicated \n(non-pregnant 14-65yrs) ",{"$f":"COUNTIF('Input Data'!$J$4:$J$1003,Patients!AL5)","v":0},{"$f":"(AM5/$AM$14)*100","v":{"$error":"#DIV/0!"}}]
[null,"05 to 13 years",{"$f":"COUNTIF('Input Data'!$G$4:$G$1003,Patients!B6)","v":0},{"$error":"#DIV/0!"},null,null,null,null,null,null,null,null,null,null,null,"No",{"$f":"COUNTIF('Input Data'!$H$4:$H$1003,Patients!P6)","v":0},{"$f":"(Q6/$Q$7)*100","v":{"$error":"#DIV/0!"}},null,null,null,null,null,null,null,null,"No",{"$f":"COUNTIF('Input Data'!$I$4:$I$1003,Patients!AA6)","v":0},{"$f":"(AB6/$AB$7)*100","v":{"$error":"#DIV/0!"}},null,null,null,null,null,null,null,null,"Older female (>65 years)",{"$f":"COUNTIF('Input Data'!$J$4:$J$1003,Patients!AL6)","v":0},{"$f":"(AM6/$AM$14)*100","v":{"$error":"#DIV/0!"}}]
[null,"14 to 29 years",{"$f":"COUNTIF('Input Data'!$G$4:$G$1003,Patients!B7)","v":0},{"$error":"#DIV/0!"},null,null,null,null,null,null,null,null,null,null,null,"Total",{"$f":"SUM(Q5:Q6)","v":0},{"$f":"SUM(R5:R6)","v":{"$error":"#DIV/0!"}},null,null,null,null,null,null,null,null,"Total",{"$f":"SUM(AB5:AB6)","v":0},{"$f":"SUM(AC5:AC6)","v":{"$error":"#DIV/0!"}},null,null,null,null,null,null,null,null,"Catheter-associated",{"$f":"COUNTIF('Input Data'!$J$4:$J$1003,Patients!AL7)","v":0},{"$error":"#DIV/0!"}]
[null,"30 to 44 years",{"$f":"COUNTIF('Input Data'!$G$4:$G$1003,Patients!B8)","v":0},{"$error":"#DIV/0!"},null,null,null,null,null,null,null,null,null,null,null,null,null,null,null,null,null,null,null,null,null,null,null,null,null,null,null,null,null,null,null,null,null,"Child (<14 yrs)",{"$f":"COUNTIF('Input Data'!$J$4:$J$1003,Patients!AL8)","v":0},{"$error":"#DIV/0!"}]
[null,"45 to 64 years",{"$f":"COUNTIF('Input Data'!$G$4:$G$1003,Patients!B9)","v":0},{"$error":"#DIV/0!"},null,null,null,null,null,null,null,null,null,null,null,null,null,null,null,null,null,null,null,null,null,null,null,null,null,null,null,null,null,null,null,null,null,"Male ",{"$f":"COUNTIF('Input Data'!$J$4:$J$1003,Patients!AL9)","v":0},{"$error":"#DIV/0!"}]
[null,"65 to 79 years",{"$f":"COUNTIF('Input Data'!$G$4:$G$1003,Patients!B10)","v":0},{"$error":"#DIV/0!"},null,null,null,null,null,null,null,null,null,null,null,null,null,null,null,null,null,null,null,null,null,null,null,null,null,null,null,null,null,null,null,null,null,"Pregnancy",{"$f":"COUNTIF('Input Data'!$J$4:$J$1003,Patients!AL10)","v":0},{"$error":"#DIV/0!"}]
[null,"80 plus years",{"$f":"COUNTIF('Input Data'!$G$4:$G$1003,Patients!B11)","v":0},{"$error":"#DIV/0!"},null,null,null,null,null,null,null,null,null,null,null,null,null,null,null,null,null,null,null,null,null,null,null,null,null,null,null,null,null,null,null,null,null,"Recurrent (≥2/6mths \nor 3/12mths)",{"$f":"COUNTIF('Input Data'!$J$4:$J$1003,Patients!AL11)","v":0},{"$error":"#DIV/0!"}]
[null,"Total",{"$f":"SUM(C5:C11)","v":0},{"$f":"SUM(D5:D11)","v":{"$error":"#DIV/0!"}},null,null,null,null,null,null,null,null,null,null,null,null,null,null,null,null,null,null,null,null,null,null,null,null,null,null,null,null,null,null,null,null,null,"Upper UTI",{"$f":"COUNTIF('Input Data'!$J$4:$J$1003,Patients!AL12)","v":0},{"$error":"#DIV/0!"}]
[null,null,null,null,null,null,null,null,null,null,null,null,null,null,null,null,null,null,null,null,null,null,null,null,null,null,null,null,null,null,null,null,null,null,null,null,null,"Unknown",{"$f":"COUNTIF('Input Data'!$J$4:$J$1003,Patients!AL13)","v":0},{"$error":"#DIV/0!"}]
[null,null,null,null,null,null,null,null,null,null,null,null,null,null,null,null,null,null,null,null,null,null,null,null,null,null,null,null,null,null,null,null,null,null,null,null,null,"Total",{"$f":"SUM(AM5:AM13)","v":0},{"$f":"SUM(AN5:AN13)","v":{"$error":"#DIV/0!"}}]

{"sheet":"Actions","index":3,"n_rows":24,"n_cols":34,"rows_kept":24,"cut":false,"hidden":false,"merged":[[0,0,0,3],[12,15,12,16],[12,30,12,31],[15,15,17,15],[14,30,17,30]]}
["Details of the action taken"]
[]
[]
["Q10","Consultation type","Count","% of cases",null,null,null,null,null,null,null,null,null,null,null,"Q11","Dipstick required/done","Count","% of cases",null,null,null,null,null,null,null,null,null,null,null,"Q13","Culture required/done","Count","% of cases"]
[null,"Face to face",{"$f":"COUNTIF('Input Data'!K$4:K$1003,Actions!B5)","v":0},{"$f":"(C5/$C$11)*100","v":{"$error":"#DIV/0!"}},null,null,null,null,null,null,null,null,null,null,null,null,"Required and done",{"$f":"COUNTIF('Input Data'!L$4:L$1003,Actions!Q5)","v":0},{"$f":"(R5/$R$10)*100","v":{"$error":"#DIV/0!"}},null,null,null,null,null,null,null,null,null,null,null,null,"Required and done",{"$f":"COUNTIF('Input Data'!N$4:N$1003,Actions!AF5)","v":0},{"$f":"(AG5/$AG$10)*100","v":{"$error":"#DIV/0!"}}]
[null,"Telephone",{"$f":"COUNTIF('Input Data'!K$4:K$1003,Actions!B6)","v":0},{"$error":"#DIV/0!"},null,null,null,null,null,null,null,null,null,null,null,null,"Not required and not done",{"$f":"COUNTIF('Input Data'!L$4:L$1003,Actions!Q6)","v":0},{"$f":"(R6/$R$10)*100","v":{"$error":"#DIV/0!"}},null,null,null,null,null,null,null,null,null,null,null,null,"Not required and not done",{"$f":"COUNTIF('Input Data'!N$4:N$1003,Actions!AF6)","v":0},{"$f":"(AG6/$AG$10)*100","v":{"$error":"#DIV/0!"}}]
[null,"No contact - issued on \nrequest HCP/patient",{"$f":"COUNTIF('Input Data'!K$4:K$1003,Actions!B7)","v":0},{"$error":"#DIV/0!"},null,null,null,null,null,null,null,null,null,null,null,null,"Required but not done",{"$f":"COUNTIF('Input Data'!L$4:L$1003,Actions!Q7)","v":0},{"$f":"(R7/$R$10)*100","v":{"$error":"#DIV/0!"}},null,null,null,null,null,null,null,null,null,null,null,null,"Required but not done",{"$f":"COUNTIF('Input Data'!N$4:N$1003,Actions!AF7)","v":0},{"$f":"(AG7/$AG$10)*100","v":{"$error":"#DIV/0!"}}]
[null,"No contact - issued on \nquestionnaire results",{"$f":"COUNTIF('Input Data'!K$4:K$1003,Actions!B8)","v":0},{"$error":"#DIV/0!"},null,null,null,null,null,null,null,null,null,null,null,null,"Not required but done",{"$f":"COUNTIF('Input Data'!L$4:L$1003,Actions!Q8)","v":0},{"$f":"(R8/$R$10)*100","v":{"$error":"#DIV/0!"}},null,null,null,null,null,null,null,null,null,null,null,null,"Not required but done",{"$f":"COUNTIF('Input Data'!N$4:N$1003,Actions!AF8)","v":0},{"$f":"(AG8/$AG$10)*100","v":{"$error":"#DIV/0!"}}]
[null,"No contact - issued on \nurinalysis results",{"$f":"COUNTIF('Input Data'!K$4:K$1003,Actions!B9)","v":0},{"$error":"#DIV/0!"},null,null,null,null,null,null,null,null,null,null,null,null,"Unknown",{"$f":"COUNTIF('Input Data'!L$4:L$1003,Actions!Q9)","v":0},{"$f":"(R9/$R$10)*100","v":{"$error":"#DIV/0!"}},null,null,null,null,null,null,null,null,null,null,null,null,"Unknown",{"$f":"COUNTIF('Input Data'!N$4:N$1003,Actions!AF9)","v":0},{"$f":"(AG9/$AG$10)*100","v":{"$error":"#DIV/0!"}}]
[null,"Unknown",{"$f":"COUNTIF('Input Data'!K$4:K$1003,Actions!B10)","v":0},{"$error":"#DIV/0!"},null,null,null,null,null,null,null,null,null,null,null,null,"Total",{"$f":"SUM(R5:R9)","v":0},{"$f":"SUM(S5:S9)","v":{"$error":"#DIV/0!"}},null,null,null,null,null,null,null,null,null,null,null,null,"Total",{"$f":"SUM(AG5:AG9)","v":0},{"$f":"SUM(AH5:AH9)","v":{"$error":"#DIV/0!"}}]
[null,"Total",{"$f":"SUM(C5:C10)","v":0},{"$f":"SUM(D5:D10)","v":{"$error":"#DIV/0!"}}]
[]
[null,null,null,null,null,null,null,null,null,null,null,null,null,null,"Q12","Reason dipstick not in line with guidance",null,"Count","% of cases",null,null,null,null,null,null,null,null,null,null,"Q14","Reason culture not in line with guidance",null,"Count","% of cases"]
[null,null,null,null,null,null,null,null,null,null,null,null,null,null,null,"In line","N/A",{"$f":"COUNTIF('Input Data'!M$4:M$1003,Actions!Q14)","v":0},{"$f":"(R14/$R$20)*100","v":{"$error":"#DIV/0!"}},null,null,null,null,null,null,null,null,null,null,null,"In line","N/A",{"$f":"COUNTIF('Input Data'!O$4:O$1003,Actions!AF14)","v":0},{"$f":"(AG14/$AG$24)*100","v":{"$error":"#DIV/0!"}}]
[null,null,null,null,null,null,null,null,null,null,null,null,null,null,null,"Required but not done","Needed to help diagnosis (e.g. \nlimited symptoms/cloudy urine)",{"$f":"COUNTIF('Input Data'!M$4:M$1003,Actions!Q15)","v":0},{"$error":"#DIV/0!"},null,null,null,null,null,null,null,null,null,null,null,"Required but not done","Equivocal dipstick and symptoms",{"$f":"COUNTIF('Input Data'!O$4:O$1003,Actions!AF15)","v":0},{"$error":"#DIV/0!"}]
{"$rows_left_out":10}
{"sheet":"Antibiotic","index":4,"n_rows":21,"n_cols":60,"rows_kept":21,"cut":false,"hidden":false,"merged":[[0,0,0,4],[10,1,10,2],[10,30,10,31],[12,30,18,30],[12,1,16,1]]}
["Details of the antibiotic prescription"]
[]
[]
[null,"Q15","Was an antibiotic required?","Count","% of cases",null,null,null,null,null,null,null,null,null,null,"Q17","Which antibiotic prescribed?","Count","% of cases",null,null,null,null,null,null,null,null,null,null,null,"Q18","Choice of antibiotic appropriate?","Count","% of cases",null,null,null,null,null,null,null,null,null,null,"Q20","Dose appropriate?","Count","% of cases",null,null,null,null,null,null,null,null,"Q22","Frequency appropriate?","Count","% of cases"]
[null,null,"Yes",{"$f":"COUNTIF('Input Data'!P$4:P$1003,C5)","v":0},{"$f":"(D5/$D$8)*100","v":{"$error":"#DIV/0!"}},null,null,null,null,null,null,null,null,null,null,null,"Cefalexin",{"$f":"COUNTIF('Input Data'!R$4:R$1003,Q5)","v":0},{"$f":"(R5/$R$14)*100","v":{"$error":"#DIV/0!"}},null,null,null,null,null,null,null,null,null,null,null,null,"Yes ",{"$f":"COUNTIF('Input Data'!S$4:S$1003,AF5)","v":0},{"$f":"(AG5/$AG$8)*100","v":{"$error":"#DIV/0!"}},null,null,null,null,null,null,null,null,null,null,null,"Yes",{"$f":"COUNTIF('Input Data'!U$4:U$1003,AT5)","v":0},{"$f":"(AU5/$AU$9)*100","v":{"$error":"#DIV/0!"}},null,null,null,null,null,null,null,null,null,"Yes",{"$f":"COUNTIF('Input Data'!V$4:V$1003,BF5)","v":0},{"$f":"(BG5/$BG$9)*100","v":{"$error":"#DIV/0!"}}]
[null,null,"No",{"$f":"COUNTIF('Input Data'!P$4:P$1003,C6)","v":0},{"$f":"(D6/$D$8)*100","v":{"$error":"#DIV/0!"}},null,null,null,null,null,null,null,null,null,null,null,"Ciprofloxacin",{"$f":"COUNTIF('Input Data'!R$4:R$1003,Q6)","v":0},{"$error":"#DIV/0!"},null,null,null,null,null,null,null,null,null,null,null,null,"No",{"$f":"COUNTIF('Input Data'!S$4:S$1003,AF6)","v":0},{"$f":"(AG6/$AG$8)*100","v":{"$error":"#DIV/0!"}},null,null,null,null,null,null,null,null,null,null,null,"No: too high",{"$f":"COUNTIF('Input Data'!U$4:U$1003,AT6)","v":0},{"$f":"(AU6/$AU$9)*100","v":{"$error":"#DIV/0!"}},null,null,null,null,null,null,null,null,null,"No: too frequent",{"$f":"COUNTIF('Input Data'!V$4:V$1003,BF6)","v":0},{"$f":"(BG6/$BG$9)*100","v":{"$error":"#DIV/0!"}}]
[null,null,"Unknown",{"$f":"COUNTIF('Input Data'!P$4:P$1003,C7)","v":0},{"$f":"(D7/$D$8)*100","v":{"$error":"#DIV/0!"}},null,null,null,null,null,null,null,null,null,null,null,"Coamoxiclav",{"$f":"COUNTIF('Input Data'!R$4:R$1003,Q7)","v":0},{"$error":"#DIV/0!"},null,null,null,null,null,null,null,null,null,null,null,null,"Unknown",{"$f":"COUNTIF('Input Data'!S$4:S$1003,AF7)","v":0},{"$f":"(AG7/$AG$8)*100","v":{"$error":"#DIV/0!"}},null,null,null,null,null,null,null,null,null,null,null,"No: too low",{"$f":"COUNTIF('Input Data'!U$4:U$1003,AT7)","v":0},{"$f":"(AU7/$AU$9)*100","v":{"$error":"#DIV/0!"}},null,null,null,null,null,null,null,null,null,"No: too infrequent",{"$f":"COUNTIF('Input Data'!V$4:V$1003,BF7)","v":0},{"$f":"(BG7/$BG$9)*100","v":{"$error":"#DIV/0!"}}]
[null,null,"Total",{"$f":"SUM(D5:D7)","v":0},{"$f":"SUM(E5:E7)","v":{"$error":"#DIV/0!"}},null,null,null,null,null,null,null,null,null,null,null,"Fosfomycin",{"$f":"COUNTIF('Input Data'!R$4:R$1003,Q8)","v":0},{"$error":"#DIV/0!"},null,null,null,null,null,null,null,null,null,null,null,null,"Total",{"$f":"SUM(AG5:AG7)","v":0},{"$f":"SUM(AH5:AH7)","v":{"$error":"#DIV/0!"}},null,null,null,null,null,null,null,null,null,null,null,"N/A",{"$f":"COUNTIF('Input Data'!U$4:U$1003,AT8)","v":0},{"$f":"(AU8/$AU$9)*100","v":{"$error":"#DIV/0!"}},null,null,null,null,null,null,null,null,null,"N/A",{"$f":"COUNTIF('Input Data'!V$4:V$1003,BF8)","v":0},{"$f":"(BG8/$BG$9)*100","v":{"$error":"#DIV/0!"}}]
[null,null,null,null,null,null,null,null,null,null,null,null,null,null,null,null,"Nitrofurantoin",{"$f":"COUNTIF('Input Data'!R$4:R$1003,Q9)","v":0},{"$error":"#DIV/0!"},null,null,null,null,null,null,null,null,null,null,null,null,null,null,null,null,null,null,null,null,null,null,null,null,null,null,"Total",{"$f":"SUM(AU5:AU8)","v":0},{"$f":"SUM(AV5:AV8)","v":{"$error":"#DIV/0!"}},null,null,null,null,null,null,null,null,null,"Total",{"$f":"SUM(BG5:BG8)","v":0},{"$f":"SUM(BH5:BH8)","v":{"$error":"#DIV/0!"}}]
[null,null,null,null,null,null,null,null,null,null,null,null,null,null,null,null,"Ofloxacin",{"$f":"COUNTIF('Input Data'!R$4:R$1003,Q10)","v":0},{"$error":"#DIV/0!"}]
["Q16","Reason why antibiotic not required",null,"Count","% of cases",null,null,null,null,null,null,null,null,null,null,null,"Pivmecillinam",{"$f":"COUNTIF('Input Data'!R$4:R$1003,Q11)","v":0},{"$error":"#DIV/0!"},null,null,null,null,null,null,null,null,null,null,"Q19","Reason choice inappropriate ",null,"Count","% of cases"]
[null,"Yes","N/A",{"$f":"COUNTIF('Input Data'!Q$4:Q$1003,C12)","v":0},{"$f":"(D12/$D$19)*100","v":{"$error":"#DIV/0!"}},null,null,null,null,null,null,null,null,null,null,null,"Trimethoprim",{"$f":"COUNTIF('Input Data'!R$4:R$1003,Q12)","v":0},{"$error":"#DIV/0!"},null,null,null,null,null,null,null,null,null,null,null,"Yes","N/A",{"$f":"COUNTIF('Input Data'!T$4:T$1003,AF12)","v":0},{"$f":"(AG12/$AG$21)*100","v":{"$error":"#DIV/0!"}}]
[null,"No","Symptoms did not support UTI",{"$f":"COUNTIF('Input Data'!Q$4:Q$1003,C13)","v":0},{"$error":"#DIV/0!"},null,null,null,null,null,null,null,null,null,null,null,"Other (state in comments)",{"$f":"COUNTIF('Input Data'!R$4:R$1003,Q13)","v":0},{"$error":"#DIV/0!"},null,null,null,null,null,null,null,null,null,null,null,"No","Empirical choice not \nin line with guidance",{"$f":"COUNTIF('Input Data'!T$4:T$1003,AF13)","v":0},{"$error":"#DIV/0!"},null,null,null,null,null,null,null,null,null,null,"Q21","Duration appropriate?","Count","% of cases",null,null,null,null,null,null,null,null,"Q23","Delayed?","Count","% of cases"]
[null,null,"Diagnostic tests did not support UTI",{"$f":"COUNTIF('Input Data'!Q$4:Q$1003,C14)","v":0},{"$error":"#DIV/0!"},null,null,null,null,null,null,null,null,null,null,null,"Total",{"$f":"SUM(R5:R13)","v":0},{"$f":"SUM(S5:S13)","v":{"$error":"#DIV/0!"}},null,null,null,null,null,null,null,null,null,null,null,null,"Choice not in line with available \nculture and sensitivity results ",{"$f":"COUNTIF('Input Data'!T$4:T$1003,AF14)","v":0},{"$error":"#DIV/0!"},null,null,null,null,null,null,null,null,null,null,null,"Yes",{"$f":"COUNTIF('Input Data'!W$4:W$1003,AT14)","v":0},{"$f":"(AU14/$AU$18)*100","v":{"$error":"#DIV/0!"}},null,null,null,null,null,null,null,null,null,"Yes",{"$f":"COUNTIF('Input Data'!X$4:X$1003,BF14)","v":0},{"$f":"(BG14/$BG$17)*100","v":{"$error":"#DIV/0!"}}]
[null,null,"Symptoms and diagnostic \ntests did not support UTI",{"$f":"COUNTIF('Input Data'!Q$4:Q$1003,C15)","v":0},{"$error":"#DIV/0!"},null,null,null,null,null,null,null,null,null,null,null,null,null,null,null,null,null,null,null,null,null,null,null,null,null,null,"Doesn't consider recent (12 months) \ntreatment, culture or sensitivities ",{"$f":"COUNTIF('Input Data'!T$4:T$1003,AF15)","v":0},{"$error":"#DIV/0!"},null,null,null,null,null,null,null,null,null,null,null,"No: too long",{"$f":"COUNTIF('Input Data'!W$4:W$1003,AT15)","v":0},{"$f":"(AU15/$AU$18)*100","v":{"$error":"#DIV/0!"}},null,null,null,null,null,null,null,null,null,"No",{"$f":"COUNTIF('Input Data'!X$4:X$1003,BF15)","v":0},{"$f":"(BG15/$BG$17)*100","v":{"$error":"#DIV/0!"}}]
{"$rows_left_out":7}
{"sheet":"Lookups","index":5,"n_rows":17,"n_cols":25,"rows_kept":17,"cut":false,"hidden":true,"merged":[[0,4,0,9],[0,10,0,14],[0,15,0,23],[0,1,0,3]]}
[null,"Audit details",null,null,"Patient",null,null,null,null,null,"Actions",null,null,null,null,"Antibiotic prescription",null,null,null,null,null,null,null,null,"Comments"]
[null,1,2,3,4,5,6,7,8,9,10,11,12,13,14,15,16,17,18,19,20,21,22,23,24]
["Case","Practice ID","Auditor ID","Audit date range","Prescriber ID","Patient ID","Age range","Care home resident?","Receiving antibiotic prophylaxis?","UTI type","Consultation type","Dipstick required/done","Reason dipstick not in line with guidance","Culture required/done","Reason culture not in line with guidance","Was an antibiotic required?","Reason why antibiotic not required","Which antibiotic prescribed","Choice of antibiotic appropriate?","Reason choice inappropriate ","Dose appropriate?","Frequency appropriate?","Duration appropriate?","Delayed?","Additional comments "]
[null,null,null,null,null,null,"0 to 4 years","Yes","Yes","Female uncomplicated \n(non-pregnant 14-65yrs) ","Face to face","Required and done","Required and done or not required and not done","Required and done","Required and done or not required and not done","Yes","Yes","Cefalexin","Yes ","Yes","Yes","Yes","Yes","Yes"]
[null,null,null,null,null,null,"05 to 13 years","No","No","Older female (>65 years)","Telephone","Not required and not done","N/A","Not required and not done","N/A","No","N/A","Ciprofloxacin","No","N/A","No: too high","No: too frequent","No: too long","No"]
[null,null,null,null,null,null,"14 to 29 years",null,null,"Catheter-associated","No contact - issued on \nrequest HCP/patient","Required but not done","Required but not done","Required but not done","Required but not done","Unknown","No","Coamoxiclav","Unknown","No","No: too low","No: too infrequent","No: too short","Unknown"]
[null,null,null,null,null,null,"30 to 44 years",null,null,"Child (<14 yrs)","No contact - issued on \nquestionnaire results","Not required but done","Needed to help diagnosis (e.g. \nlimited symptoms/cloudy urine)","Not required but done","Equivocal dipstick and symptoms",null,"Symptoms did not support UTI","Fosfomycin",null,"Empirical choice not \nin line with guidance","N/A","N/A","N/A"]
[null,null,null,null,null,null,"45 to 64 years",null,null,"Male ","No contact - issued on \nurinalysis results","Unknown","Not required but done","Unknown","Persistent/recurrent symptoms",null,"Diagnostic tests did not support UTI","Nitrofurantoin",null,"Choice not in line with available \nculture and sensitivity results "]
[null,null,null,null,null,null,"65 to 79 years",null,null,"Pregnancy","Unknown",null,"UTI unlikely (no or mild or ≤2 \nsymptoms and clear urine)",null,"UTI type: older, male, catheter, \npregnancy, upper or child",null,"Symptoms and diagnostic \ntests did not support UTI","Ofloxacin",null,"Doesn't consider recent (12 months) \ntreatment, culture or sensitivities "]
[null,null,null,null,null,null,"80 plus years",null,null,"Recurrent (≥2/6mths \nor 3/12mths)",null,null,"Symptoms diagnostic \n(e.g. severe or ≥3 symptoms)",null,"Risk factors e.g. renal/urinary tract \nabnormality, immunosuppression",null,"Insufficent or incorrect \nassessment/testing","Pivmecillinam",null,"Contraindicated e.g. \nallergy/renal interactions"]
[null,null,null,null,null,null,null,null,null,"Upper UTI",null,null,"Dipstick testing unrealiable ",null,"Not required but done",null,"Alternative approaches could have \nbeen used (e.g. analgesia, delaying)","Trimethoprim",null,"Alternative approaches could have \nbeen used (e.g. analgesia, delaying)"]
[null,null,null,null,null,null,null,null,null,"Unknown",null,null,"Unknown",null,"UTI unlikely (no or mild or ≤2 \nsymptoms and clear urine)",null,"Unknown","Other (state in comments)",null,"Antibiotic wasn't required"]
[null,null,null,null,null,null,null,null,null,null,null,null,"Insufficient information",null,"Symptoms diagnostic \n(e.g. severe or ≥3 symptoms)",null,"Insufficent information",null,null,"Other"]
[null,null,null,null,null,null,null,null,null,null,null,null,null,null,"Dipstick testing sufficient",null,null,null,null,"Unknown"]
[null,null,null,null,null,null,null,null,null,null,null,null,null,null,"Unknown",null,null,null,null,"Insufficient information"]
{"$rows_left_out":2}